{"text_format":"1","workbook":"xlsx","n_sheets":16,"sheets":["INICIO","1. Datos Generales","2. Actividad Económica","3. Bienes o Servicios","4. Principales Socios","5. Pers. Politicamente Expuesta","6. Trámite de Pagos","7. Declaración Jurada","8. Anexo","Zonas","Listas","Data","Profile","Risk","Revision","Formulario"],"not_rendered":{"charts":0,"images":4,"macros":1,"external_links":0,"defined_names":16,"comments":4,"pivot_tables":0},"unopened":[],"bounds":{"document_bytes":16777216,"sheet_cells":100000,"rows_first":2000,"rows_last":500,"rows_between":2000,"halvings":0,"cell_chars":16384,"cell_head_chars":4096},"cells_cut":0,"cells_raw":0,"read":"whole","date_system":"1900"}

{"sheet":"INICIO","index":0,"n_rows":18,"n_cols":6,"rows_kept":18,"cut":false,"hidden":false,"merged":[]}
[]
[]
[]
[]
[]
[]
[]
[]
[]
[]
{"$rows_left_out":9}
{"sheet":"1. Datos Generales","index":1,"n_rows":52,"n_cols":19,"rows_kept":52,"cut":false,"hidden":true,"merged":[[34,12,34,15],[19,8,19,10],[19,13,19,15],[21,4,21,5],[21,12,21,13],[23,12,23,15],[23,4,23,7],[25,12,25,13],[29,4,29,6],[29,12,29,15],[31,4,31,6],[33,12,33,15],[5,12,5,15],[7,4,7,7],[9,4,9,6],[9,12,9,14],[5,4,5,7],[13,12,13,14],[13,4,13,6],[15,4,15,6],[25,4,25,7],[17,4,17,15],[19,4,19,5],[36,4,36,7],[36,12,36,13],[38,4,38,5],[38,12,38,14],[40,4,40,6],[42,4,42,5],[42,8,42,10],[42,13,42,15],[44,4,44,15],[48,1,49,15]]}
[]
[null,null,null,null,null,null,null,null,null,null,null,null,null,null,null,null,null,null,{"$f":"COUNTIFS(R:R,\"X\")","v":5}]
[]
[]
[]
[null,"Nombre o Razón Social",null,null,null,null,null,null,null,"Nombre Comercial",null,null,null,null,null,null,null,{"$f":"IF(COUNTA(E6,M6,E8,E10,E12,E14,M14,E16,E18,E20,I20,N20,E22,E24,M24,E28,E30,E32)<18,\"X\",\"OK\")","v":"X"}]
[]
[null,"Nombre completo Contacto",null,null,null,null,null,null,null,"Oficina de Salud Ocupacional",null,null,null,null,null,null,null,{"$f":"IF(M8=\"\",\"X\",IF(M8=\"SI\",IF(M10=\"\",\"X\",\"OK\"),\"OK\"))","v":"X"}]
[]
[null,"Número de Cédula",null,null,null,null,null,null,null,"Persona encargada"]
{"$rows_left_out":43}
{"sheet":"2. Actividad Económica","index":2,"n_rows":62,"n_cols":23,"rows_kept":62,"cut":false,"hidden":true,"merged":[[26,6,26,9],[28,6,28,7],[32,6,32,9]]}
[]
[null,null,null,null,null,null,null,null,null,null,null,null,null,null,null,null,null,null,{"$f":"COUNTIFS(P:P,\"X\")","v":2}]
[]
[]
[]
[null,null,null,null,null,null,null,"SECTOR PRIMARIO",null,"SECTOR SECUNDARIO",null,"SECTOR TERCIARIO",null,"SECTOR CUATERNARIO"]
[]
[null,"Sector comercial principal (coloque X en la casilla)",null,null,null,null,null,"Agrícola",null,"Construcción",null,"Administración",null,"Investigación",null,{"$f":"IF(COUNTA(G8:G24,I8:I24,K8:K24,M8:M24,G27)>1,\"X\",\"OK\")","v":"OK"}]
[]
[null,{"$f":"IF(COUNTA(G8,G10,G12,G14,G16,I8,I10,I12,I14,K8,K10,K12,K14,K16,K18,K20,K22,K24,M8,M10,M12,M14)>1,\"Debe seleccionar sólo la actividad principal\",\"\")","v":""},null,null,null,null,null,"Forestal",null,"Cultural",null,"Artístico",null,"Tecnología de información"]
{"$rows_left_out":53}
{"sheet":"3. Bienes o Servicios","index":3,"n_rows":14,"n_cols":19,"rows_kept":14,"cut":false,"hidden":true,"merged":[[5,8,5,15],[7,8,7,15],[9,8,9,15],[11,8,11,15],[13,8,13,15]]}
[]
[null,null,null,null,null,null,null,null,null,null,null,null,null,null,null,null,null,null,{"$f":"COUNTIFS(R:R,\"X\")","v":1}]
[]
[]
[]
[null,"Enliste los bienes o servicios que provee a Coopemep RL",null,null,null,null,null,"1.",null,null,null,null,null,null,null,null,{"$f":"IF(I6=\"\",\"\",LEN(I6))","v":""},{"$f":"IF(I6=\"\",\"X\",\"OK\")","v":"X"}]
[null,"(MINIMO 1)"]
[null,null,null,null,null,null,null,"2.",null,null,null,null,null,null,null,null,{"$f":"IF(I8=\"\",\"\",LEN(I8))","v":""}]
[]
[null,null,null,null,null,null,null,"3.",null,null,null,null,null,null,null,null,{"$f":"IF(I10=\"\",\"\",LEN(I10))","v":""}]
{"$rows_left_out":5}
{"sheet":"4. Principales Socios","index":4,"n_rows":18,"n_cols":19,"rows_kept":18,"cut":false,"hidden":true,"merged":[]}
[]
[null,null,null,null,null,null,null,null,null,null,null,null,null,null,null,null,null,null,{"$f":"COUNTIFS(K:K,\"X\")","v":1}]
[]
[]
[]
[null,"Enliste los socios que tengan más de un 10% de participación"]
[]
[null,"#","Nombres","Apellido 1","Apellido 2","Nacionalidad","Identificación","% participación"]
[]
[null,"1.",null,null,null,null,null,null,null,null,{"$f":"IF(COUNTA(C10:H10)<6,\"X\",IF(SUM(H10:H18)>1,\"X\",\"OK\"))","v":"X"}]
{"$rows_left_out":9}
{"sheet":"5. Pers. Politicamente Expuesta","index":5,"n_rows":12,"n_cols":19,"rows_kept":12,"cut":false,"hidden":true,"merged":[[9,1,9,3],[9,4,9,6],[9,7,9,9],[11,1,11,3],[11,4,11,6],[11,7,11,9],[13,1,13,3],[13,4,13,6],[13,7,13,9],[15,1,15,3],[15,4,15,6],[15,7,15,9],[17,1,17,3],[17,4,17,6],[17,7,17,9],[19,1,19,3],[19,4,19,6],[19,7,19,9]]}
[]
[null,null,null,null,null,null,null,null,null,null,null,null,null,null,null,null,null,null,{"$f":"IF('1. Datos Generales'!H52=\"SI\",COUNTIFS(P:P,\"X\"),0)","v":0}]
[]
[]
[null,null,null,null,null,null,null,null,null,null,null,null,null,null,null,{"$f":"IF(COUNTA(I6:I8)<2,\"X\",\"OK\")","v":"X"}]
[null,"Es usted una Persona Políticamente Expuesta (PEP):"]
[]
[null,"Tiene su empresa relación con una Persona Políticamente Expuesta (PEP):"]
[]
[null,"Nombres",null,null,"Apellido 1",null,null,"Apellido 2",null,null,"Identificación","Tipo relación","Cargo respectivo","Fecha finalización"]
{"$rows_left_out":3}
{"sheet":"6. Trámite de Pagos","index":6,"n_rows":32,"n_cols":19,"rows_kept":32,"cut":false,"hidden":true,"merged":[[29,5,29,8],[5,5,5,9],[7,5,7,6],[9,5,9,8],[13,5,13,9],[23,5,23,9],[15,5,15,7],[25,5,25,7],[17,5,17,8],[27,5,27,8],[19,5,19,8]]}
[]
[null,null,null,null,null,null,null,null,null,null,null,null,null,null,null,null,null,null,{"$f":"COUNTIFS(P:P,\"X\")","v":1}]
[]
[]
[]
[null,"Encargado de trámites de facturas",null,null,null,null,null,null,null,null,null,null,null,null,null,{"$f":"IF(COUNTA(F6,F8,F10)<3,\"X\",\"OK\")","v":"X"}]
[]
[null,"Teléfono"]
[]
[null,"Correo electrónico"]
{"$rows_left_out":23}
{"sheet":"7. Declaración Jurada","index":7,"n_rows":19,"n_cols":19,"rows_kept":19,"cut":false,"hidden":true,"merged":[[19,1,19,4],[19,6,19,8],[19,10,19,12],[5,1,9,12],[13,3,13,6],[11,3,11,6],[15,1,16,12],[18,10,18,12],[18,1,18,4]]}
[]
[null,null,null,null,null,null,null,null,null,null,null,null,null,null,null,null,null,null,{"$f":"COUNTIFS(P:P,\"X\")","v":1}]
[]
[]
[]
[null,"Con el fin de dar cumplimiento a la Ley Nº 7786: Ley sobre estupefacientes, sustancias psicotrópicas, drogas de uso no autorizado, actividades conexas, legitimación de capitales y financiamiento al terrorismo y Normativa conexa, he recibido información con apercibimiento de las penas con que el ordenamiento jurídico costarricense y el Código Penal castiga el delito de perjurio; y declaro, bajo la fe de juramento, que la información que estoy proporcionando a Coopemep es cierta, veraz y que no he incurrido en falsedad alguna."]
[]
[]
[]
[]
{"$rows_left_out":10}
{"sheet":"8. Anexo","index":8,"n_rows":38,"n_cols":24,"rows_kept":38,"cut":false,"hidden":true,"merged":[[4,1,4,15],[5,1,5,15],[6,1,6,15],[8,1,8,15],[22,1,23,15],[9,1,9,15],[10,1,11,15],[12,1,12,15],[13,1,13,15],[14,1,14,15],[16,1,16,15],[17,1,17,15],[18,1,18,15],[19,1,19,15],[21,1,21,15],[24,1,25,15],[26,1,26,15],[27,1,29,15],[30,1,32,15],[37,5,37,8],[37,12,37,15]]}
[]
[null,null,null,null,null,null,null,null,null,null,null,null,null,null,null,null,null,null,{"$f":"IF(K36=\"SI\",0,1)","v":1}]
[]
[]
[null,"ANEXO"]
[null,"Documentación requerida"]
[null,"(Se reciben documentos unicamente vigentes y legibles)"]
[]
[null,"Requisitos: "]
[null,"1. Completar el formulario y no dejar espacios en blanco, en caso de no aplica la casilla se debe indicar N/A"]
{"$rows_left_out":29}
{"sheet":"Zonas","index":9,"n_rows":234,"n_cols":20,"rows_kept":234,"cut":false,"hidden":true,"merged":[]}
["Costa Rica",null,"San José","San José","Alajuela","Cartago","Heredia","Liberia","Puntarenas","Limón","Seleccione provincia",null,"(San José) Carmen","(Alajuela) Alajuela","(Cartago) Oriental","(Heredia) Heredia","(Liberia) Liberia","(Puntarenas) Puntarenas","(Limón) Limón","Seleccione cantón"]
["Nicaragua",null,"Alajuela","Escazú","San Ramón","Paraíso","Barva","Nicoya","Esparza","Pococí",null,null,"(San José) Merced","(Alajuela) San José","(Cartago) Occidental","(Heredia) Mercedes","(Liberia) Cañas Dulces","(Puntarenas) Pitahaya","(Limón) Valle La Estrella"]
["Estados Unidos",null,"Cartago","Desamparados","Grecia","La Uníon","Santo Domingo","Santa Cruz","Buenos Aires","Siquirres",null,null,"(San José) Hospital","(Alajuela) Carrizal","(Cartago) Carmen","(Heredia) San Francisco","(Liberia) Mayorga","(Puntarenas) Chomes","(Limón) Río Blanco"]
["Afganistán",null,"Heredia","Puriscal","San Mateo","Jiménez","Santa Barbara","Bagaces","Montes de Oro","Talamanca",null,null,"(San José) Catedral","(Alajuela) San Antonio","(Cartago) San Nicolas","(Heredia) Ulloa","(Liberia) Nacascolo","(Puntarenas) Lepanto","(Limón) Matama"]
["Albania",null,"Guanacaste","Tarrazu","Atenas","Turrialba","San Rafael","Carrillo","Osa","Matina",null,null,"(San José) Zapote","(Alajuela) Guacima","(Cartago) Aguacaliente (San Francisco)","(Heredia) Varablanca","(Liberia) Curubande","(Puntarenas) Paquera","(Pococí) Guapiles"]
["Alemania",null,"Puntarenas","Aserrí","Naranjo","Alvarado","San Isidro","Cañas","Aguirre","Guácimo",null,null,"(San José) San Francisco De Dos Ríos","(Alajuela) San Isidro","(Cartago) Guadalupe (Arenilla)","(Barva) Barva","(Nicoya) Nicoya","(Puntarenas) Manzanillo","(Pococí) Jiménez"]
["Andorra",null,"Limón","Mora","Palmares","Oreamuno","Belen","Abangares","Golfito",null,null,null,"(San José) Uruca","(Alajuela) Sabanilla","(Cartago) Corralillo","(Barva) San Pedro","(Nicoya) Mansion","(Puntarenas) Guacimal","(Pococí) Rita"]
["Angola",null,null,"Goicoechea","Poas","El Guarco","Flores","Tilaran","Coto Brus",null,null,null,"(San José) Mata Redonda","(Alajuela) San Rafael","(Cartago) Tierra Blanca","(Barva) San Pablo","(Nicoya) San Antonio","(Puntarenas) Barranca","(Pococí) Roxana"]
["Anguilla",null,null,"Santa Ana","Orotina",null,"San Pablo","Nandayure","Parrita",null,null,null,"(San José) Pavas","(Alajuela) Río Segundo","(Cartago) Dulce Nombre","(Barva) San Roque","(Nicoya) Quebrada Honda","(Puntarenas) Monte Verde","(Pococí) Cariari"]
["Antártida",null,null,"Alajuelita","San Carlos",null,"Sarapiquí","La Cruz","Corredores",null,null,null,"(San José) Hatillo","(Alajuela) Desamparados","(Cartago) Llano Grande","(Barva) Santa Lucia","(Nicoya) Samara","(Puntarenas) Isla Del Coco","(Pococí) Colorado"]
{"$rows_left_out":225}
{"sheet":"Listas","index":10,"n_rows":67,"n_cols":20,"rows_kept":67,"cut":false,"hidden":true,"merged":[]}
["Nacional","Hombre","Abogado","Venta productos/Servicios","Menor a ₵1 millón mensual","Padre","Banco de Costa Rica",null,"San José","San José",1,"primero",1,"enero",2021,"dos mil veintiuno",null,"Alquileres  (Tecnológicos) ",null,"Activo"]
["Residencia","Mujer","Administrador","Alquileres e inversiones","Entre ₵1 - ₵5 millones mensual","Madre","Banco Nacional de Costa Rica",null,"Moravia","Moravia, San José",2,"dos",2,"febrero",2022,"dos mil veintidós",null,"Alquiler locales",null,"Inactivo"]
[null,"Otro","Agricultura","Otras fuentes de ingreso","Entre ₵5 - ₵10 millones mensual","Conyuge","Banco Popular y de Desarrollo Comunal",null,"Torre Mercedes","San José",3,"tres",3,"marzo",2023,"dos mil veintitrés",null,"Alquiler (leasing - renting)",null,"Pendiente"]
[null,null,"Albañilería",null,"Mayor a ₵10 millones mensual","Hermano(a)","Bancrédito",null,"Desamparados","Desamparados, San José",4,"cuatro",4,"abril",2024,"dos mil veinticuatro",null,"Arendamiento de equipos tecnologicos"]
[null,null,"Animación",null,null,"Hijo(a)","Banco BAC San José S.A.",null,"Alajuela","Alajuela",5,"cinco",5,"mayo",2025,"dos mil veinticinco",null,"Capacitacion al personal"]
[null,null,"Antropólogo",null,null,"Abuelo(a)","Banco Promérica",null,"Cartago","Cartago",6,"seis",6,"junio",2026,"dos mil veintiséis",null,"Capacitación directivos"]
[null,null,"Archivólogo",null,null,"Tío(a)","Scotiabank de Costa Rica S.A.",null,"Turrialba","Turrialba, Cartago",7,"siete",7,"julio",2027,"dos mil veintisiete",null,"Capacitacion externos"]
[null,null,"Arqueólogo",null,null,"Primo(a)","Banco Davivienda Costa Rica",null,"Heredia","Heredia",8,"ocho",8,"agosto",2028,"dos mil veintiocho",null,"Compra de Activos mobiliario y equipo"]
[null,null,"Arquitecto",null,null,"Familia Politica","Banco Lafise S.A.",null,"Pérez Zeledón","Pérez Zeledón",9,"nueve",9,"septiembre",2029,"dos mil veintinueve",null,"Compra de Activos y/o Productos"]
[null,null,"Bibliotecólogo",null,null,null,"Banco BCT S.A.",null,"San Carlos","San Carlos",10,"diez",10,"octubre",2030,"dos mil treinta",null,"Compra de Productos"]
{"$rows_left_out":58}
{"sheet":"Data","index":11,"n_rows":1,"n_cols":135,"rows_kept":1,"cut":false,"hidden":true,"merged":[]}
["Registro","Nombre o Razón Social","Nombre Comercial","Nombre completo Contacto","Oficina de Salud Ocupacional","Persona encargada","Número de Cédula","Colaboradores","País de Constitución","Fecha Constitución","País donde reside la empresa","Dirección detallada y señas","Provincia","Cantón","Distrito","Celular contacto","Teléfono fijo","Extension","Correo electrónico empresarial","Página web","Correo electrónico contacto","Puesto de Contacto","Inscrito MH","Origen de ingresos","Otras fuentes","Estimado ingresos / mes","Relación Coopemep R.L.","Nombre del colaborador","Puesto que desempeña","Nombre completo Representante","Tipo de identificación","Celular de Representante","Identificación Representante","Nacionalidad Representante","Provincia Representante","Cantón Representante","Distrito Representante","Dirección detallada y señas Representante","SUGEF","Cargos Publicos","Actividad comercial principal","Fecha de inicio","Años","Detalle de la actividad","Bienes o Servicios 1","Bienes o Servicios 2","Bienes o Servicios 3","Bienes o Servicios 4","Bienes o Servicios 5","Socio 1 Nombres","Socio 1 Apellido 1","Socio 1 Apellido 2","Socio 1 Nacionalidad","Socio 1 Identificación","Socio 1 % participación","Socio 2 Nombres","Socio 2 Apellido 1","Socio 2 Apellido 2","Socio 2 Nacionalidad","Socio 2 Identificación","Socio 2 % participación","Socio 3 Nombres","Socio 3 Apellido 1","Socio 3 Apellido 2","Socio 3 Nacionalidad","Socio 3 Identificación","Socio 3 % participación","Socio 4 Nombres","Socio 4 Apellido 1","Socio 4 Apellido 2","Socio 4 Nacionalidad","Socio 4 Identificación","Socio 4 % participación","Socio 5 Nombres","Socio 5 Apellido 1","Socio 5 Apellido 2","Socio 5 Nacionalidad","Socio 5 Identificación","Socio 5 % participación","Es PEP","Relacion con PEP","PEP1 Nombres","PEP1 Apellido 1","PEP1 Apellido 2","PEP1 Ident.","PEP1 Tipo relación","PEP1 Cargo respectivo","PEP1 Fecha finalización","PEP2 Nombres","PEP2 Apellido 1","PEP2 Apellido 2","PEP2 Ident.","PEP2 Tipo relación","PEP2 Cargo respectivo","PEP2 Fecha finalización","PEP3 Nombres","PEP3 Apellido 1","PEP3 Apellido 2","PEP3 Ident.","PEP3 Tipo relación","PEP3 Cargo respectivo","PEP3 Fecha finalización","PEP4 Nombres","PEP4 Apellido 1","PEP4 Apellido 2","PEP4 Ident.","PEP4 Tipo relación","PEP4 Cargo respectivo","PEP4 Fecha finalización","PEP5 Nombres","PEP5 Apellido 1","PEP5 Apellido 2","PEP5 Ident.","PEP5 Tipo relación","PEP5 Cargo respectivo","PEP5 Fecha finalización","Encargado trámite","Teléfono","Correo electrónico","CRC Nombre del Banco","CRC No. Cuenta Corriente ","CRC No. Cuenta Cliente ","CRC IBAN ","USD Nombre del Banco","USD No. Cuenta Corriente ","USD No. Cuenta Cliente ","USD IBAN ","Sucursal","Fecha de firma","Nombre proveedor","Cedula proveedor","Anexo","Fecha registro","Tipo","Nombre completo"]

{"sheet":"Profile","index":12,"n_rows":2,"n_cols":36,"rows_kept":2,"cut":false,"hidden":true,"merged":[]}
["Registro","Identificación","Tipo de proveedor","Nombre proveedor","Actividad económica","Criterio Riesgo Criticidad","Indic Criticidad","Artículo 15 o 15 bis","Indic A15","Categoría","Indic Categoría","Persona expuesta públicamente","Indic PEP","Lista de Referencia","Indic Lista Referencia","Representante Legal","Indic Representante Legal","Criterio Controlado","Indic Controlado","Registro de Transparencia","Indic Transparencia","Observaciones del Servicio","Clasificación","Frecuencia","Fecha de revisión","Fecha próxima revisión","Revisado por","Observaciones de la revisión","Estado","Tiempo de Inactividad","Indic Tiempo inactividad","Criterio para inactivación","Fecha de Inactivación","Actualización","Revaluación del Proveedor","RIESGO"]
[{"$f":"Data!A2","v":0},{"$f":"Data!G2","v":0}]

{"sheet":"Risk","index":13,"n_rows":78,"n_cols":13,"rows_kept":78,"cut":false,"hidden":true,"merged":[]}
[]
[null,"Riesgo","Criterio Riesgo - Criticidad"]
[null,3,"1. Proveedores A identificados como críticos según el análisis BIA (Análisis de Impacto al Negocio) elaborador por el área de Continuidad de Negocios",null,null,null,null,null,"A","Críticos según BIA (Análisis de Impacto al Negocio), área de Continuidad de Negocios",3,12,"A"]
[null,2,"2. Proveedores B importantes para Cooperativa, pero que no detienen la continuidad de las operaciones crítica",null,null,null,null,null,"B","Importantes, pero que no detienen la continuidad de las operaciones críticas",2,24,"B"]
[null,1,"3. Proveedores C de uso regular, no detienen la continuidad de las operaciones críticas y/o regulares de la Cooperativa",null,null,null,null,null,"C","Uso regular, no detienen la continuidad de las operaciones críticas/regulares",1,36,"C"]
[]
[]
[]
[null,"Riesgo","Criterio Proveedor Controlado"]
[null,3,"1. Prestan directamente el servicio en nombre de la Cooperativa.",null,null,null,null,null,null,"Presta servicio directo en nombre de la Cooperativa",3]
{"$rows_left_out":69}
{"sheet":"Revision","index":14,"n_rows":30,"n_cols":19,"rows_kept":30,"cut":false,"hidden":true,"merged":[[3,2,3,4],[3,10,3,12],[5,10,5,14],[9,2,9,6],[11,2,11,6],[7,11,7,14],[9,11,9,14],[13,10,13,14],[13,2,13,6],[15,2,15,6],[15,10,15,14],[17,2,17,6],[19,2,19,14],[25,2,25,4],[25,10,25,12],[27,2,27,6],[29,2,29,14]]}
[]
[null,null,null,null,null,null,null,null,null,null,null,null,null,null,null,null,null,null,{"$f":"IF(S4<14,1,0)","v":1}]
[]
[null,"Registro",{"$f":"Data!A2","v":0},null,null,null,null,null,null,"Identificación",{"$f":"Data!G2","v":0},null,null,null,null,null,null,null,{"$f":"COUNTA(C8,L8,L10,C12,C14,C16,C18,K14,K16,C20,C22,C24,C28,C30)","v":2}]
[]
[null,"Tipo de proveedor","Jurídico",null,null,null,null,null,null,"Nombre proveedor",{"$f":"TRIM(UPPER('1. Datos Generales'!E6))","v":""}]
[]
[null,"Estado",null,null,null,null,null,null,null,"Artículo 15 o 15 bis",{"$f":"Data!AM2","v":0},null,null,null,null,{"$f":"IFERROR(VLOOKUP(L8,Risk!J62:K65,2,0),\"\")","v":""}]
[]
[null,"Actividad económica",{"$f":"Data!AR2","v":0},null,null,null,null,null,null,"Persona expuesta públicamente",{"$f":"Data!AN2","v":0},null,null,null,null,{"$f":"IFERROR(VLOOKUP(L10,Risk!J69:K70,2,0),\"\")","v":""}]
{"$rows_left_out":21}
{"sheet":"Formulario","index":15,"n_rows":192,"n_cols":16,"rows_kept":192,"cut":false,"hidden":true,"merged":[[14,4,14,6],[14,12,14,14],[18,4,18,15],[20,4,20,5],[20,8,20,10],[20,13,20,15],[6,4,6,7],[6,12,6,15],[8,4,8,7],[8,12,8,13],[10,4,10,6],[10,12,10,14],[16,4,16,6],[85,8,85,15],[87,8,87,15],[89,8,89,15],[91,8,91,15],[93,8,93,15],[95,1,95,15],[4,1,4,15],[76,6,76,9],[78,6,78,7],[82,6,82,9],[54,1,54,15],[83,1,83,15],[30,4,30,6],[30,12,30,15],[32,4,32,6],[34,12,34,15],[35,12,35,15],[49,1,50,15],[22,4,22,5],[22,12,22,13],[24,4,24,7],[24,12,24,15],[26,4,26,7],[26,12,26,13],[99,2,99,4],[99,5,99,7],[99,8,99,10],[99,11,99,12],[99,13,99,14],[101,2,101,4],[101,5,101,7],[101,8,101,10],[101,11,101,12],[101,13,101,14],[103,2,103,4],[103,5,103,7],[103,8,103,10],[103,11,103,12],[103,13,103,14],[105,2,105,4],[105,5,105,7],[105,8,105,10],[105,11,105,12],[105,13,105,14],[107,2,107,4],[107,5,107,7],[107,8,107,10],[107,11,107,12],[107,13,107,14],[109,2,109,4],[109,5,109,7],[109,8,109,10],[109,11,109,12],[109,13,109,14],[111,1,111,15],[117,1,117,3],[117,4,117,6],[117,7,117,9],[119,1,119,3],[119,4,119,6],[119,7,119,9],[117,10,117,11],[119,10,119,11],[117,13,117,14],[119,13,119,14],[121,10,121,11],[121,13,121,14],[123,10,123,11],[123,13,123,14],[125,10,125,11],[125,13,125,14],[125,1,125,3],[125,4,125,6],[125,7,125,9],[121,1,121,3],[121,4,121,6],[121,7,121,9],[123,1,123,3],[123,4,123,6],[123,7,123,9],[139,5,139,7],[141,5,141,7],[143,5,143,7],[139,13,139,15],[141,13,141,15],[143,13,143,15],[145,1,145,15],[127,10,127,11],[127,13,127,14],[129,1,129,15],[131,5,131,9],[133,5,133,6],[135,5,135,8],[127,1,127,3],[127,4,127,6],[127,7,127,9],[159,1,159,15],[161,1,161,15],[162,1,162,15],[164,1,164,15],[165,1,165,15],[157,1,157,4],[157,13,157,15],[147,1,147,15],[157,7,157,10],[156,7,156,10],[153,1,154,15],[149,3,149,6],[151,3,151,6],[156,1,156,4],[156,13,156,15],[183,1,185,15],[186,1,188,15],[174,1,174,15],[175,1,175,15],[177,1,177,15],[178,1,179,15],[180,1,181,15],[182,1,182,15],[166,1,167,15],[168,1,168,15],[169,1,169,15],[170,1,170,15],[172,1,172,15],[173,1,173,15],[37,4,37,7],[37,12,37,13],[39,4,39,5],[39,12,39,14],[41,4,41,6],[43,4,43,5],[43,8,43,10],[43,13,43,15],[45,4,45,15]]}
[]
[]
[]
[]
[null,"1. Información general del Proveedor"]
[]
[null,"Nombre o Razón Social",null,null,null,null,null,null,null,"Nombre Comercial"]
[]
[null,"Nombre completo Contacto",null,null,null,null,null,null,null,"Oficina de Salud Ocupacional"]
[]
{"$rows_left_out":182}